cairo-dock-team team mailing list archive
-
cairo-dock-team team
-
Mailing list archive
-
Message #03279
Re: [Bug 831149] [NEW] cairo-dock-plugins version 2.3.0~3-2 failed to build in oneiric
why is the plug-ins version 2.3.0 ? it should be 2.4.0, as the core.
both core and plug-ins must be of the same version, that's why the
compilation fails.
2011/8/22 Matthias Klose <doko@xxxxxxxxxx>
> Public bug reported:
>
> cairo-dock-plugins version 2.3.0~3-2 failed to build in oneiric
> Link to failed build:
> https://launchpad.net/ubuntu/+archive/test-rebuild-20110816/+build/2689821
>
> Details about the rebuild:
>
> http://people.ubuntuwire.org/~wgrant/rebuild-ftbfs-test/test-rebuild-20110816-oneiric.html
>
> Direct link to the build log: https://launchpad.net/ubuntu/+archive
> /test-rebuild-20110816/+build/2689821/+files/buildlog_ubuntu-oneiric-
> amd64.cairo-dock-plugins_2.3.0%7E3-2_FAILEDTOBUILD.txt.gz<https://launchpad.net/ubuntu/+archive%0A/test-rebuild-20110816/+build/2689821/+files/buildlog_ubuntu-oneiric-%0Aamd64.cairo-dock-plugins_2.3.0%7E3-2_FAILEDTOBUILD.txt.gz>
>
> This log snippet might be of interest, since it triggered the matcher
> 'Purging chroot-autobuild'.
> Excerpt 1768 lines into the build log:
>
> -- Check for working C compiler: /usr/bin/cc
> -- Check for working C compiler: /usr/bin/cc -- works
> -- Detecting C compiler ABI info
> -- Detecting C compiler ABI info - done
> -- Check for working CXX compiler: /usr/bin/g++
> -- Check for working CXX compiler: /usr/bin/g++ -- works
> -- Detecting CXX compiler ABI info
> -- Detecting CXX compiler ABI info - done
> CMake Error at CMakeLists.txt:65 (MESSAGE):
> warning : version mismatch with the core : 2.3.0<>2.4.0~0beta2
>
>
> -- Configuring incomplete, errors occurred!
> make: *** [obj-x86_64-linux-gnu/CMakeCache.txt] Error 1
> dpkg-buildpackage: error: debian/rules build gave error exit status 2
>
> ******************************************************************************
> Build finished at 20110819-2353
> FAILED [dpkg-buildpackage died]
> Purging chroot-autobuild/build/buildd/cairo-dock-plugins-2.3.0~3
>
> ** Affects: cairo-dock-plugins (Ubuntu)
> Importance: High
> Status: Confirmed
>
> ** Affects: cairo-dock-plugins (Ubuntu Oneiric)
> Importance: High
> Status: Confirmed
>
>
> ** Tags: ftbfs oneiric
>
> ** Changed in: cairo-dock-plugins (Ubuntu)
> Status: New => Confirmed
>
> ** Changed in: cairo-dock-plugins (Ubuntu)
> Importance: Undecided => High
>
> ** Also affects: cairo-dock-plugins (Ubuntu Oneiric)
> Importance: High
> Status: Confirmed
>
> --
> You received this bug notification because you are a member of Cairo-
> Dock Team, which is subscribed to cairo-dock-plugins in Ubuntu.
> https://bugs.launchpad.net/bugs/831149
>
> Title:
> cairo-dock-plugins version 2.3.0~3-2 failed to build in oneiric
>
> Status in “cairo-dock-plugins” package in Ubuntu:
> Confirmed
> Status in “cairo-dock-plugins” source package in Oneiric:
> Confirmed
>
> Bug description:
> cairo-dock-plugins version 2.3.0~3-2 failed to build in oneiric
> Link to failed build:
> https://launchpad.net/ubuntu/+archive/test-rebuild-20110816/+build/2689821
>
> Details about the rebuild:
>
> http://people.ubuntuwire.org/~wgrant/rebuild-ftbfs-test/test-rebuild-20110816-oneiric.html
>
> Direct link to the build log: https://launchpad.net/ubuntu/+archive
> /test-rebuild-20110816/+build/2689821/+files/buildlog_ubuntu-oneiric-
> amd64.cairo-dock-plugins_2.3.0%7E3-2_FAILEDTOBUILD.txt.gz
>
> This log snippet might be of interest, since it triggered the matcher
> 'Purging chroot-autobuild'.
> Excerpt 1768 lines into the build log:
>
> -- Check for working C compiler: /usr/bin/cc
> -- Check for working C compiler: /usr/bin/cc -- works
> -- Detecting C compiler ABI info
> -- Detecting C compiler ABI info - done
> -- Check for working CXX compiler: /usr/bin/g++
> -- Check for working CXX compiler: /usr/bin/g++ -- works
> -- Detecting CXX compiler ABI info
> -- Detecting CXX compiler ABI info - done
> CMake Error at CMakeLists.txt:65 (MESSAGE):
> warning : version mismatch with the core : 2.3.0<>2.4.0~0beta2
>
>
> -- Configuring incomplete, errors occurred!
> make: *** [obj-x86_64-linux-gnu/CMakeCache.txt] Error 1
> dpkg-buildpackage: error: debian/rules build gave error exit status 2
>
> ******************************************************************************
> Build finished at 20110819-2353
> FAILED [dpkg-buildpackage died]
> Purging chroot-autobuild/build/buildd/cairo-dock-plugins-2.3.0~3
>
> To manage notifications about this bug go to:
>
> https://bugs.launchpad.net/ubuntu/+source/cairo-dock-plugins/+bug/831149/+subscriptions
>
> _______________________________________________
> Mailing list: https://launchpad.net/~cairo-dock-team
> Post to : cairo-dock-team@xxxxxxxxxxxxxxxxxxx
> Unsubscribe : https://launchpad.net/~cairo-dock-team
> More help : https://help.launchpad.net/ListHelp
>
--
You received this bug notification because you are a member of Cairo-
Dock Team, which is subscribed to cairo-dock-plugins in Ubuntu.
https://bugs.launchpad.net/bugs/831149
Title:
cairo-dock-plugins version 2.3.0~3-2 failed to build in oneiric
Status in “cairo-dock-plugins” package in Ubuntu:
Confirmed
Status in “cairo-dock-plugins” source package in Oneiric:
Confirmed
Bug description:
cairo-dock-plugins version 2.3.0~3-2 failed to build in oneiric
Link to failed build: https://launchpad.net/ubuntu/+archive/test-rebuild-20110816/+build/2689821
Details about the rebuild:
http://people.ubuntuwire.org/~wgrant/rebuild-ftbfs-test/test-rebuild-20110816-oneiric.html
Direct link to the build log: https://launchpad.net/ubuntu/+archive
/test-rebuild-20110816/+build/2689821/+files/buildlog_ubuntu-oneiric-
amd64.cairo-dock-plugins_2.3.0%7E3-2_FAILEDTOBUILD.txt.gz
This log snippet might be of interest, since it triggered the matcher 'Purging chroot-autobuild'.
Excerpt 1768 lines into the build log:
-- Check for working C compiler: /usr/bin/cc
-- Check for working C compiler: /usr/bin/cc -- works
-- Detecting C compiler ABI info
-- Detecting C compiler ABI info - done
-- Check for working CXX compiler: /usr/bin/g++
-- Check for working CXX compiler: /usr/bin/g++ -- works
-- Detecting CXX compiler ABI info
-- Detecting CXX compiler ABI info - done
CMake Error at CMakeLists.txt:65 (MESSAGE):
warning : version mismatch with the core : 2.3.0<>2.4.0~0beta2
-- Configuring incomplete, errors occurred!
make: *** [obj-x86_64-linux-gnu/CMakeCache.txt] Error 1
dpkg-buildpackage: error: debian/rules build gave error exit status 2
******************************************************************************
Build finished at 20110819-2353
FAILED [dpkg-buildpackage died]
Purging chroot-autobuild/build/buildd/cairo-dock-plugins-2.3.0~3
To manage notifications about this bug go to:
https://bugs.launchpad.net/ubuntu/+source/cairo-dock-plugins/+bug/831149/+subscriptions
References