dhis2-devs team mailing list archive
-
dhis2-devs team
-
Mailing list archive
-
Message #36086
Code build error 2.18
Hello,
can anyone help me solve this error,
I wm building dhis2 2.18 code ,
I m running this command : I m using mvn clean -Dmaven.test.skip=true
install
[INFO] BUILD FAILURE
[INFO]
------------------------------------------------------------------------
[INFO] Total time: 03:35 min
[INFO] Finished at: 2015-03-04T09:36:13+02:00
[INFO] Final Memory: 43M/103M
[INFO]
------------------------------------------------------------------------
[ERROR] Failed to execute goal on project dhis-support-test: Could not
resolve dependencies for project org.hisp.dhis:dhis-support-test:jar:2.18:
Failed to collect dependencies at org.amplecode:quick:jar:1.11: Failed to
read artifact descriptor for org.amplecode:quick:jar:1.11: Could not
transfer artifact org.amplecode:quick:pom:1.11 from/to
amplecode_maven2_repo (http://maven.dhis2.org/amplecode-local): Connect to
maven.dhis2.org:80 [maven.dhis2.org/178.79.143.102] failed: Connection
timed out -> [Help 1]
[ERROR]
[ERROR] To see the full stack trace of the errors, re-run Maven with the -e
switch.
[ERROR] Re-run Maven using the -X switch to enable full debug logging.
[ERROR]
[ERROR] For more information about the errors and possible solutions,
please read the following articles:
[ERROR] [Help 1]
http://cwiki.apache.org/confluence/display/MAVEN/DependencyResolutionException
[ERROR]
[ERROR] After correcting the problems, you can resume the build with the
command
[ERROR] mvn <goals> -rf :dhis-support-test
regards
--
*-----*
*JEAN PAUL MUTALI*
Tel: +250 78-862-8000, +1 845-584-1789
Kicukiro, Av 21, P.O.Box 371 Kigali - RWANDA
Skype: mutali.rw
<http://mutali.rw>
Follow ups