← Back to team overview

dolfin team mailing list archive

error

 

In installing the dolfin I encounter the following error
+++++++++++++++++++++++++++++++++++++++++++++++++++++++++++
ln: creating symbolic link `src/demo/solvers/ode/stiff/testproblems//plotslab.m'
 to `/mnt/e/m.izadi/project/Dolfin/dolfin-0.5.5/src/utils/matlab/plotslab.m': Op
eration not permitted
make[2]: *** [all] Error 1
make[2]: Leaving directory `/mnt/e/m.izadi/project/Dolfin/dolfin-0.5.5/src/post'
make[1]: *** [all-recursive] Error 1
make[1]: Leaving directory `/mnt/e/m.izadi/project/Dolfin/dolfin-0.5.5/src'
make: *** [all-recursive] Error 1
[root@localhost dolfin-0.5.5]#
+++++++++++++++++++++++++++++++++++
please help me to remove it.
Thanks.