← Back to team overview

drizzle-discuss team mailing list archive

Error while building drizzle


Here is the command line output for the error.

mv unistd.h-t unistd.h
make  all-recursive
make[3]: Entering directory
make[4]: Entering directory
  CC     libgnu_la-dummy.lo
dummy.c:41: fatal error: opening dependency file .deps/libgnu_la-dummy.Tpo:
Permission denied
compilation terminated.
make[4]: *** [libgnu_la-dummy.lo] Error 1
make[4]: Leaving directory
make[3]: *** [all-recursive] Error 1
make[3]: Leaving directory
make[2]: *** [all] Error 2
make[2]: Leaving directory
make[1]: *** [all-recursive] Error 1
make[1]: Leaving directory `/home/ashish/Documents/gsoc/boots/drizzle'
make: *** [all] Error 2
ashish@topgun:~/Documents/gsoc/boots/drizzle$ cd gnulib/.deps/
ashish@topgun:~/Documents/gsoc/boots/drizzle/gnulib/.deps$ ls
libgnu_la-dummy.Plo  libgnu_la-getopt1.Plo  libgnu_la-getopt.Plo
libgnu_la-mktime.Plo  libgnu_la-timegm.Plo  libgnu_la-time_r.Plo

I see that there in no file  named libgnu_la-dummy.Tpo  in .deps folder.
Still the error mentions checking for a .Tpo file.
So how can I resolve this error??

irc: _buck@xxxxxxxxxxxxxxxx

Follow ups