← Back to team overview

elementary-dev-community team mailing list archive

Error compiling at launchpad


Hi everyone,

I'm trying to compile a project to add it into my ppa but I get this error
from launchpad:

- checking for modules
--   package 'gtk+-3.0' not found
--   package 'gdu' not found
--   package 'appindicator3-0.1' not found
--   package 'libnotify' not found
--   package 'granite' not found
CMake Error at /usr/share/cmake-2.8/Modules/FindPkgConfig.cmake:266
  A required package was not found
Call Stack (most recent call first):
  CMakeLists.txt:9 (pkg_check_modules)

-- Found Vala: /usr/bin/valac
-- checking for a minimum Vala version of 0.16.0
--   found Vala, version 0.16.0
-- Configuring incomplete, errors occurred!
dh_auto_configure: cmake .. -DCMAKE_INSTALL_PREFIX=/usr
-DCMAKE_VERBOSE_MAKEFILE=ON returned exit code 1
make: *** [build] Error 2
dpkg-buildpackage: error: debian/rules build gave error exit status 2
Build finished at 20130915-2303
FAILED [dpkg-buildpackage died]


Someone know how fix it or what I forget to configure?


Follow ups