← Back to team overview

kernel-packages team mailing list archive

[Bug 1543461] [NEW] linux: intermittent ADT test failures on ppc64el

 

Public bug reported:

The linux internal test suites fail intermittently (1/3 approx) as
below:

[...]
  test_parser_testsuite (__main__.ApparmorTestsuites)
  Run parser regression tests ... ok
  test_regression_testsuite (__main__.ApparmorTestsuites)
  Run kernel regression tests ... FAIL
  test_stress_parser_testsuite (__main__.ApparmorTestsuites)
  Run parser stress test ... ok
[...]
  ======================================================================
  FAIL: test_regression_testsuite (__main__.ApparmorTestsuites)
  Run kernel regression tests
  ----------------------------------------------------------------------
  Traceback (most recent call last):
    File "./test-apparmor.py", line 1589, in test_regression_testsuite
      self.assertEquals(expected, rc, result + report)
  AssertionError: Got exit code 2, expected 0

** Affects: linux (Ubuntu)
     Importance: Medium
         Status: Confirmed

** Changed in: linux (Ubuntu)
       Status: New => Confirmed

** Changed in: linux (Ubuntu)
   Importance: Undecided => Medium

-- 
You received this bug notification because you are a member of Kernel
Packages, which is subscribed to linux in Ubuntu.
https://bugs.launchpad.net/bugs/1543461

Title:
  linux: intermittent ADT test failures on ppc64el

Status in linux package in Ubuntu:
  Confirmed

Bug description:
  The linux internal test suites fail intermittently (1/3 approx) as
  below:

  [...]
    test_parser_testsuite (__main__.ApparmorTestsuites)
    Run parser regression tests ... ok
    test_regression_testsuite (__main__.ApparmorTestsuites)
    Run kernel regression tests ... FAIL
    test_stress_parser_testsuite (__main__.ApparmorTestsuites)
    Run parser stress test ... ok
  [...]
    ======================================================================
    FAIL: test_regression_testsuite (__main__.ApparmorTestsuites)
    Run kernel regression tests
    ----------------------------------------------------------------------
    Traceback (most recent call last):
      File "./test-apparmor.py", line 1589, in test_regression_testsuite
        self.assertEquals(expected, rc, result + report)
    AssertionError: Got exit code 2, expected 0

To manage notifications about this bug go to:
https://bugs.launchpad.net/ubuntu/+source/linux/+bug/1543461/+subscriptions


Follow ups