← Back to team overview

maas-devel team mailing list archive

Build failed in Jenkins: saucy-adt-maas-daily » amd64,lenovo-RD230-01 #94

 

See <http://10.189.74.2:8080/job/saucy-adt-maas-daily/./ARCH=amd64,label=lenovo-RD230-01/94/>

------------------------------------------
[...truncated 3023 lines...]
 > maasserver:0020_nodegroup_dhcp_interfaces_is_plural
 > maasserver:0021_add_uuid_to_nodegroup
 > maasserver:0022_add_status_to_nodegroup
 > maasserver:0023_add_bootimage_model
 > maasserver:0024_add_nodegroupinterface
 > maasserver:0025_remove_unused_fields_in_nodegroup
 > maasserver:0026_add_node_distro_series
 > maasserver:0027_add_tag_table
 > maasserver:0028_add_node_hardware_details
 > maasserver:0029_zone_sharing
 > maasserver:0030_ip_address_to_generic_ip_address
 > maasserver:0031_node_architecture_field_size
 > maasserver:0032_node_subarch
 > maasserver:0033_component_error
 > maasserver:0034_timestamp_component_error
 > maasserver:0035_add_nodegroup_cluster_name
 > maasserver:0036_populate_nodegroup_cluster_name
 > maasserver:0037_nodegroup_cluster_name_unique
 > maasserver:0038_nodegroupinterface_ip_range_fix
 > maasserver:0039_add_filestorage_content
 > maasserver:0039_add_nodegroup_to_bootimage
 > maasserver:0040_make_filestorage_data_not_null
 > maasserver:0041_remove_filestorage_data
 > maasserver:0042_fix_039_conflict
 > maasserver:0043_unique_hostname_preparation
 > maasserver:0044_node_hostname_unique
 > maasserver:0045_add_tag_kernel_opts
 > maasserver:0046_add_nodegroup_maas_url
 > maasserver:0047_add_owner_to_filestorage
 > maasserver:0048_add_key_to_filestorage
 > maasserver:0049_filestorage_key_unique
 > maasserver:0050_shared_to_per_tenant_storage
 > maasserver:0051_bigger_distro_series_name
 - Loading initial data for maasserver.
Installed 0 object(s) from 0 fixture(s)
Running migrations for metadataserver:
 - Migrating forwards to 0010_add_script_result.
 > metadataserver:0001_initial
 > metadataserver:0002_add_nodecommissionresult
 > metadataserver:0003_populate_hardware_details
 > metadataserver:0004_add_commissioningscript
 > metadataserver:0005_nodecommissionresult_add_timestamp
 > metadataserver:0006_nodecommissionresult_add_status
 > metadataserver:0007_nodecommissionresult_change_name_size
 > metadataserver:0008_rename_lshw_commissioning_output
 > metadataserver:0009_delete_status
 > metadataserver:0010_add_script_result
 - Loading initial data for metadataserver.
Installed 1 object(s) from 1 fixture(s)
 * Restarting web server apache2
apache2: Could not reliably determine the server's fully qualified domain name, using 127.0.1.1 for ServerName
 ... waiting .apache2: Could not reliably determine the server's fully qualified domain name, using 127.0.1.1 for ServerName
   ...done.
squid-deb-proxy stop/waiting
squid-deb-proxy start/running, process 26642
maas-txlongpoll start/running, process 26725
maas-region-celery start/running, process 26806
Processing triggers for ureadahead ...
Setting up maas (1.4+bzr1538+dfsg-0+1538+195~ppa0~saucy1) ...
Setting up python-testtools (0.9.30-0ubuntu4) ...
Setting up python-extras (0.0.3-2) ...
Processing triggers for libc-bin ...
ldconfig deferred processing now taking place
Errors were encountered while processing:
 isc-dhcp-server
 maas-dhcp
 maas-dns
E: Sub-process /usr/bin/dpkg returned an error code (1)
 -> Trying to fix apt error
Setting up isc-dhcp-server (4.2.4-7ubuntu1) ...
isc-dhcp-server6 stop/waiting
Setting up maas-dhcp (1.4+bzr1538+dfsg-0+1538+195~ppa0~saucy1) ...
maas-dhcp-server stop/pre-start, process 26999
Processing triggers for ureadahead ...
Setting up maas-dns (1.4+bzr1538+dfsg-0+1538+195~ppa0~saucy1) ...
 * Stopping domain name service... bind9
waiting for pid 22554 to die
   ...done.
 * Starting domain name service... bind9
   ...done.
Reading package lists...
Building dependency tree...
Reading state information...
bzr is already the newest version.
python-nose is already the newest version.
python-testtools is already the newest version.
python-yaml is already the newest version.
juju-core is already the newest version.
python-pip is already the newest version.
python-zmq is already the newest version.
maas is already the newest version.
maas-dhcp is already the newest version.
maas-dns is already the newest version.
maas-cli is already the newest version.
The following packages were automatically installed and are no longer required:
  html2text libpth20
Use 'apt-get autoremove' to remove them.
0 upgraded, 0 newly installed, 0 to remove and 0 not upgraded.
 -> Apt bug workaround succeeded
 -> Finished parsing the build-deps
adt-run: trace: & ubtree1t-maas-package-test: [----------------------------------------
+ buildtree=/tmp/tmp.5I6iLYOtde/ubtree1-ubtree/
+ shift
+ rm -rf -- /tmp/tmp.5I6iLYOtde/ubtree1t-maas-package-test-testtmp /tmp/tmp.5I6iLYOtde/ubtree1t-maas-package-test-testtmp/tmpdir /tmp/tmp.5I6iLYOtde/ubtree1t-maas-package-test-testtmp/adttmp
+ mkdir -- /tmp/tmp.5I6iLYOtde/ubtree1t-maas-package-test-testtmp /tmp/tmp.5I6iLYOtde/ubtree1t-maas-package-test-testtmp/tmpdir /tmp/tmp.5I6iLYOtde/ubtree1t-maas-package-test-testtmp/adttmp
adt-run: trace: & ubtree1t-maas-package-test:  - - - - - - - - - - results - - - - - - - - - -
ubtree1t-maas-package-test FAIL non-zero exit status 1
adt-run: trace: & ubtree1t-maas-package-test:  - - - - - - - - - - stdout - - - - - - - - - -
Ignoring indexes: https://pypi.python.org/simple/
Downloading/unpacking nose-timer
  Running setup.py egg_info for package nose-timer
    
Installing collected packages: nose-timer
  Running setup.py install for nose-timer
    
Successfully installed nose-timer
Cleaning up...
maas-integration.TestMAASIntegration.test_disable_raring ... ok
maas-integration.TestMAASIntegration.test_create_admin ... ok
maas-integration.TestMAASIntegration.test_update_maas_url ... ok
maas-integration.TestMAASIntegration.test_restart_dbus_avahi ... ok
maas-integration.TestMAASIntegration.test_check_initial_services ... ok
maas-integration.TestMAASIntegration.test_update_pxe_config ... ok
maas-integration.TestMAASIntegration.test_import_pxe_files ... ok
maas-integration.TestMAASIntegration.test_update_preseed_arm ... ok
maas-integration.TestMAASIntegration.test_login_api ... ok
maas-integration.TestMAASIntegration.test_set_http_proxy ... SKIP: Not testing proxy.
maas-integration.TestMAASIntegration.test_cluster_connected ... ok
maas-integration.TestMAASIntegration.test_set_up_dhcp_region ... ok
maas-integration.TestMAASIntegration.test_check_dhcp_service ... ok
maas-integration.TestMAASIntegration.test_set_up_dhcp_cluster ... SKIP: Not testing cluster controller
maas-integration.TestMAASIntegration.test_update_dns_config ... ok
maas-integration.TestMAASIntegration.test_boot_nodes_enlist ... ok
maas-integration.TestMAASIntegration.test_check_nodes_declared ... ERROR
SKIP: Not testing Cluster controller

======================================================================
ERROR: maas-integration.TestMAASIntegration.test_check_nodes_declared
----------------------------------------------------------------------
_StringException: maas-cli maas ['nodes', 'list']: {{{('[]\n', '')}}}

Traceback (most recent call last):
  File "/tmp/tmp.5I6iLYOtde/ubtree1-ubtree/debian/tests/utils.py", line 31, in wrapper
    result = func(*args, **kwargs)
  File "/tmp/tmp.5I6iLYOtde/ubtree1-ubtree/debian/tests/maas-integration.py", line 509, in test_check_nodes_declared
    self._wait_nodes(0)
  File "/tmp/tmp.5I6iLYOtde/ubtree1-ubtree/debian/tests/maas-integration.py", line 501, in _wait_nodes
    sleep(5)
  File "/tmp/tmp.5I6iLYOtde/ubtree1-ubtree/debian/tests/utils.py", line 25, in _handle_timeout
    raise TimeoutError(error_message)
TimeoutError: Timer expired


maas-integration.TestMAASIntegration.test_update_pxe_config: 0.0002s
maas-integration.TestMAASIntegration.test_disable_raring: 0.0002s
maas-integration.TestMAASIntegration.test_update_preseed_arm: 0.0097s
maas-integration.TestMAASIntegration.test_check_dhcp_service: 0.0136s
maas-integration.TestMAASIntegration.test_check_initial_services: 0.0501s
maas-integration.TestMAASIntegration.test_restart_dbus_avahi: 0.1176s
maas-integration.TestMAASIntegration.test_create_admin: 0.1391s
maas-integration.TestMAASIntegration.test_cluster_connected: 0.2127s
maas-integration.TestMAASIntegration.test_login_api: 0.5095s
maas-integration.TestMAASIntegration.test_boot_nodes_enlist: 0.7361s
maas-integration.TestMAASIntegration.test_update_dns_config: 1.3352s
maas-integration.TestMAASIntegration.test_update_maas_url: 2.1335s
maas-integration.TestMAASIntegration.test_set_up_dhcp_region: 3.2027s
maas-integration.TestMAASIntegration.test_import_pxe_files: 415.2218s
maas-integration.TestMAASIntegration.test_check_nodes_declared: 420.0206s
----------------------------------------------------------------------
Ran 17 tests in 843.715s

FAILED (SKIP=3, errors=1)
adt-run: trace: & ubtree1t-maas-package-test: ----------------------------------------]
adt-run: trace1: ** needs_reset, previously=False
adt-run: trace: @@@@@@@@@@@@@@@@@@@@@@@@@@@@@@@@@@@@@@@@ tests done.
adt-run: trace: ** stop
adt-run: trace: ** close, scratch=tb-scratch~/tmp/tmp.5I6iLYOtde:-/|/tmp/tmp.5I6iLYOtde/!
+ RC=4
+ [ 4 -eq 20 ]
+ [ 0 -eq 1 ]
+ [ -x /home/ubuntu/adt-export-result ]
+ RES=PASS
+ [ 4 -gt 0 ]
+ RES=FAIL
+ /home/ubuntu/adt-export-result -D /root/adt-log maas FAIL
+ chown -R ubuntu /root/adt-log
+ chmod og+r /var/log/syslog
+ chmod og+r /var/crash/*
+ true
+ exit 4
+ RET=4
+ [ 0 -eq 1 ]
+ [ 4 -gt 0 ]
+ log_failure_msg adt-run exited with status 4.
+ log_msg Failure: adt-run exited with status 4.\n
+ date +%F %X
+ printf 2013-07-14 22:49:02: Failure: adt-run exited with status 4.\n
2013-07-14 22:49:02: Failure: adt-run exited with status 4.
+ [ 0 -eq 0 ]
+ mkdir -p <http://10.189.74.2:8080/job/saucy-adt-maas-daily/./ARCH=amd64,label=lenovo-RD230-01/ws/results>
+ dirname /root/adt-log
+ ssh -o UserKnownHostsFile=/dev/null -o StrictHostKeyChecking=no -o CheckHostIP=no -i /var/tmp/adt/disks/adtkey -p 54323 -t -o BatchMode=yes -l ubuntu localhost sudo chown -R ubuntu /root; find /root/adt-log -type f -empty | xargs rm -Rf
Pseudo-terminal will not be allocated because stdin is not a terminal.
Warning: Permanently added '[localhost]:54323' (ECDSA) to the list of known hosts.
+ scp -r -o UserKnownHostsFile=/dev/null -o StrictHostKeyChecking=no -o CheckHostIP=no -i /var/tmp/adt/disks/adtkey -P 54323 ubuntu@localhost:/root/adt-log/*
    /var/crash/*crash /var/log/syslog <http://10.189.74.2:8080/job/saucy-adt-maas-daily/./ARCH=amd64,label=lenovo-RD230-01/ws/results>
+ true
+ log_info_msg Test artifacts copied to <http://10.189.74.2:8080/job/saucy-adt-maas-daily/./ARCH=amd64,label=lenovo-RD230-01/ws/results>
+ log_msg Info: Test artifacts copied to <http://10.189.74.2:8080/job/saucy-adt-maas-daily/./ARCH=amd64,label=lenovo-RD230-01/ws/results\n>
+ date +%F %X
+ printf 2013-07-14 22:49:06: Info: Test artifacts copied to <http://10.189.74.2:8080/job/saucy-adt-maas-daily/./ARCH=amd64,label=lenovo-RD230-01/ws/results\n>
2013-07-14 22:49:06: Info: Test artifacts copied to <http://10.189.74.2:8080/job/saucy-adt-maas-daily/./ARCH=amd64,label=lenovo-RD230-01/ws/results>
+ [ -n 2013-07-14_23-30-55 ]
+ log_info_msg Updating Jenkins results
+ log_msg Info: Updating Jenkins results\n
+ date +%F %X
+ printf 2013-07-14 22:49:06: Info: Updating Jenkins results\n
2013-07-14 22:49:06: Info: Updating Jenkins results
+ rsync -a <http://10.189.74.2:8080/job/saucy-adt-maas-daily/./ARCH=amd64,label=lenovo-RD230-01/ws/results/saucy_amd64_maas_20130715-024912.result> /saucy/out/
rsync: mkdir "/saucy/out" failed: No such file or directory (2)
rsync error: error in file IO (code 11) at main.c(605) [Receiver=3.0.9]
rsync: connection unexpectedly closed (9 bytes received so far) [sender]
rsync error: error in rsync protocol data stream (code 12) at io.c(605) [sender=3.0.9]
+ true
+ [ 0 -eq 0 ]
+ ssh -o UserKnownHostsFile=/dev/null -o StrictHostKeyChecking=no -o CheckHostIP=no -i /var/tmp/adt/disks/adtkey -p 54323 -t -o BatchMode=yes -l ubuntu localhost sudo poweroff
Pseudo-terminal will not be allocated because stdin is not a terminal.
Warning: Permanently added '[localhost]:54323' (ECDSA) to the list of known hosts.
+ exit 4
+ on_exit
+ log_info_msg Cleaning up
+ log_msg Info: Cleaning up\n
+ date +%F %X
+ printf 2013-07-14 22:49:06: Info: Cleaning up\n
2013-07-14 22:49:06: Info: Cleaning up
+ [ -f /var/tmp/adt/disks/saucy-amd64-maas-20130714_222856.IetD94.img.pid ]
+ cat /var/tmp/adt/disks/saucy-amd64-maas-20130714_222856.IetD94.img.pid
+ kill -9 32730
+ rm -f /var/tmp/adt/disks/saucy-amd64-maas-20130714_222856.IetD94.img.pid
+ rm -f /var/tmp/adt/disks/saucy-amd64-maas-20130714_222856.IetD94.img
+ rm -f /var/lock/adt/ssh.54323.lock
+ rm -f /var/lock/adt/vnc.5911.lock
+ [ -d /tmp/adt-amd64.uHQdl0 ]
+ rm -Rf /tmp/adt-amd64.uHQdl0
+ rm -f /var/tmp/adt/disks/saucy-amd64-maas-*.img*
+ find /var/lock/adt -name *.lock -mtime +1
+ exit 4
Build step 'Execute shell' marked build as failure
Archiving artifacts


Follow ups

References