← Back to team overview

maas-devel team mailing list archive

Build failed in Jenkins: saucy-adt-maas-daily » amd64,lenovo-RD230-01 #136

 

See <http://10.189.74.2:8080/job/saucy-adt-maas-daily/./ARCH=amd64,label=lenovo-RD230-01/136/>

------------------------------------------
[...truncated 2184 lines...]
Creating tables ...
Creating table auth_permission
Creating table auth_group_permissions
Creating table auth_group
Creating table auth_user_groups
Creating table auth_user_user_permissions
Creating table auth_user
Creating table django_content_type
Creating table django_session
Creating table django_site
Creating table piston_nonce
Creating table piston_consumer
Creating table piston_token
Creating table south_migrationhistory
Installing custom SQL ...
Installing indexes ...
Installed 0 object(s) from 0 fixture(s)

Synced:
 > django.contrib.auth
 > django.contrib.contenttypes
 > django.contrib.sessions
 > django.contrib.sites
 > django.contrib.messages
 > django.contrib.staticfiles
 > piston
 > south

Not synced (use migrations):
 - maasserver
 - metadataserver
(use ./manage.py migrate to migrate these)
Running migrations for maasserver:
 - Migrating forwards to 0052_add_node_storage.
 > maasserver:0001_initial
 > maasserver:0002_add_token_to_node
 > maasserver:0002_macaddress_unique
 > maasserver:0003_rename_sshkeys
 > maasserver:0004_add_node_error
 > maasserver:0005_sshkey_user_and_key_unique_together
 > maasserver:0006_increase_filestorage_filename_length
 > maasserver:0007_common_info_created_add_time
 > maasserver:0008_node_power_address
 > maasserver:0009_add_nodegroup
 > maasserver:0010_add_node_netboot
 > maasserver:0011_add_dns_zone_serial_sequence
 > maasserver:0012_DHCPLease
 > maasserver:0013_connect_node_node_group
 > maasserver:0014_nodegroup_dhcp_settings_are_optional
 > maasserver:0016_node_nodegroup_not_null
 > maasserver:0017_add_dhcp_key_to_nodegroup
 > maasserver:0018_activate_worker_user
 > maasserver:0019_add_nodegroup_dhcp_interface
 > maasserver:0020_nodegroup_dhcp_interfaces_is_plural
 > maasserver:0021_add_uuid_to_nodegroup
 > maasserver:0022_add_status_to_nodegroup
 > maasserver:0023_add_bootimage_model
 > maasserver:0024_add_nodegroupinterface
 > maasserver:0025_remove_unused_fields_in_nodegroup
 > maasserver:0026_add_node_distro_series
 > maasserver:0027_add_tag_table
 > maasserver:0028_add_node_hardware_details
 > maasserver:0029_zone_sharing
 > maasserver:0030_ip_address_to_generic_ip_address
 > maasserver:0031_node_architecture_field_size
 > maasserver:0032_node_subarch
 > maasserver:0033_component_error
 > maasserver:0034_timestamp_component_error
 > maasserver:0035_add_nodegroup_cluster_name
 > maasserver:0036_populate_nodegroup_cluster_name
 > maasserver:0037_nodegroup_cluster_name_unique
 > maasserver:0038_nodegroupinterface_ip_range_fix
 > maasserver:0039_add_filestorage_content
 > maasserver:0039_add_nodegroup_to_bootimage
 > maasserver:0040_make_filestorage_data_not_null
 > maasserver:0041_remove_filestorage_data
 > maasserver:0042_fix_039_conflict
 > maasserver:0043_unique_hostname_preparation
 > maasserver:0044_node_hostname_unique
 > maasserver:0045_add_tag_kernel_opts
 > maasserver:0046_add_nodegroup_maas_url
 > maasserver:0047_add_owner_to_filestorage
 > maasserver:0048_add_key_to_filestorage
 > maasserver:0049_filestorage_key_unique
 > maasserver:0050_shared_to_per_tenant_storage
 > maasserver:0051_bigger_distro_series_name
 > maasserver:0052_add_node_storage
 - Loading initial data for maasserver.
Installed 0 object(s) from 0 fixture(s)
Running migrations for metadataserver:
 - Migrating forwards to 0010_add_script_result.
 > metadataserver:0001_initial
 > metadataserver:0002_add_nodecommissionresult
 > metadataserver:0003_populate_hardware_details
 > metadataserver:0004_add_commissioningscript
 > metadataserver:0005_nodecommissionresult_add_timestamp
 > metadataserver:0006_nodecommissionresult_add_status
 > metadataserver:0007_nodecommissionresult_change_name_size
 > metadataserver:0008_rename_lshw_commissioning_output
 > metadataserver:0009_delete_status
 > metadataserver:0010_add_script_result
 - Loading initial data for metadataserver.
Installed 1 object(s) from 1 fixture(s)
 * Restarting web server apache2
AH00558: apache2: Could not reliably determine the server's fully qualified domain name, using 127.0.1.1. Set the 'ServerName' directive globally to suppress this message
   ...done.
squid-deb-proxy stop/waiting
squid-deb-proxy start/running, process 15653
maas-txlongpoll start/running, process 15735
maas-region-celery start/running, process 15819
Processing triggers for ureadahead ...
Setting up maas (1.4+bzr1548+dfsg-0+1549+198~ppa0~saucy1) ...
Setting up maas-dns (1.4+bzr1548+dfsg-0+1549+198~ppa0~saucy1) ...
 * Stopping domain name service... bind9
waiting for pid 11438 to die
   ...done.
 * Starting domain name service... bind9
   ...done.
Setting up python-testtools (0.9.30-0ubuntu4) ...
Setting up python-extras (0.0.3-2) ...
Processing triggers for libc-bin ...
Errors were encountered while processing:
 juju-core
E: Sub-process /usr/bin/dpkg returned an error code (1)
 -> Trying to fix apt error
Setting up juju-core (1.13.1-0ubuntu1) ...
update-alternatives: --slave needs <link> <name> <path>

Usage: update-alternatives [<option> ...] <command>

Commands:
  --install <link> <name> <path> <priority>
    [--slave <link> <name> <path>] ...
                           add a group of alternatives to the system.
  --remove <name> <path>   remove <path> from the <name> group alternative.
  --remove-all <name>      remove <name> group from the alternatives system.
  --auto <name>            switch the master link <name> to automatic mode.
  --display <name>         display information about the <name> group.
  --query <name>           machine parseable version of --display <name>.
  --list <name>            display all targets of the <name> group.
  --get-selections         list master alternative names and their status.
  --set-selections         read alternative status from standard input.
  --config <name>          show alternatives for the <name> group and ask the
                           user to select which one to use.
  --set <name> <path>      set <path> as alternative for <name>.
  --all                    call --config on all alternatives.

<link> is the symlink pointing to /etc/alternatives/<name>.
  (e.g. /usr/bin/pager)
<name> is the master name for this link group.
  (e.g. pager)
<path> is the location of one of the alternative target files.
  (e.g. /usr/bin/less)
<priority> is an integer; options with higher numbers have higher priority in
  automatic mode.

Options:
  --altdir <directory>     change the alternatives directory.
  --admindir <directory>   change the administrative directory.
  --log <file>             change the log file.
  --force                  allow replacing files with alternative links.
  --skip-auto              skip prompt for alternatives correctly configured
                           in automatic mode (relevant for --config only)
  --verbose                verbose operation, more output.
  --quiet                  quiet operation, minimal output.
  --help                   show this help message.
  --version                show the version.
dpkg: error processing juju-core (--configure):
 subprocess installed post-installation script returned error exit status 2
Errors were encountered while processing:
 juju-core
E: Unrecoverable error installing build-dependencies.
blame: arg:. arg:/home/ubuntu/packaging/debian/tests/maas-control arg:. arg:/home/ubuntu/packaging/debian/tests/maas-control
badpkg: dependency install failed, exit code 1
adt-run: erroneous package: dependency install failed, exit code 1
adt-run: trace: ** stop
adt-run: trace: ** close, scratch=tb-scratch~/tmp/tmp.MSqdX7KM88:-/|/tmp/tmp.MSqdX7KM88/!
+ RC=12
+ [ 12 -eq 20 ]
+ [ 0 -eq 1 ]
+ [ -x /home/ubuntu/adt-export-result ]
+ RES=PASS
+ [ 12 -gt 0 ]
+ RES=FAIL
+ /home/ubuntu/adt-export-result -D /root/adt-log maas FAIL
+ chown -R ubuntu /root/adt-log
+ chmod og+r /var/log/syslog
+ chmod og+r /var/crash/*
+ true
+ exit 12
+ RET=12
+ [ 0 -eq 1 ]
+ [ 12 -gt 0 ]
+ log_failure_msg adt-run exited with status 12.
+ log_msg Failure: adt-run exited with status 12.\n
+ date +%F %X
+ printf 2013-08-20 22:09:27: Failure: adt-run exited with status 12.\n
2013-08-20 22:09:27: Failure: adt-run exited with status 12.
+ [ 0 -eq 0 ]
+ mkdir -p <http://10.189.74.2:8080/job/saucy-adt-maas-daily/./ARCH=amd64,label=lenovo-RD230-01/ws/results>
+ dirname /root/adt-log
+ ssh -o UserKnownHostsFile=/dev/null -o StrictHostKeyChecking=no -o CheckHostIP=no -i /var/tmp/adt/disks/adtkey -p 54323 -t -o BatchMode=yes -l ubuntu localhost sudo chown -R ubuntu /root; find /root/adt-log -type f -empty | xargs rm -Rf
Pseudo-terminal will not be allocated because stdin is not a terminal.
Warning: Permanently added '[localhost]:54323' (ECDSA) to the list of known hosts.
+ scp -r -o UserKnownHostsFile=/dev/null -o StrictHostKeyChecking=no -o CheckHostIP=no -i /var/tmp/adt/disks/adtkey -P 54323 ubuntu@localhost:/root/adt-log/*
    /var/crash/*crash /var/log/syslog <http://10.189.74.2:8080/job/saucy-adt-maas-daily/./ARCH=amd64,label=lenovo-RD230-01/ws/results>
+ true
+ log_info_msg Test artifacts copied to <http://10.189.74.2:8080/job/saucy-adt-maas-daily/./ARCH=amd64,label=lenovo-RD230-01/ws/results>
+ log_msg Info: Test artifacts copied to <http://10.189.74.2:8080/job/saucy-adt-maas-daily/./ARCH=amd64,label=lenovo-RD230-01/ws/results\n>
+ date +%F %X
+ printf 2013-08-20 22:09:29: Info: Test artifacts copied to <http://10.189.74.2:8080/job/saucy-adt-maas-daily/./ARCH=amd64,label=lenovo-RD230-01/ws/results\n>
2013-08-20 22:09:29: Info: Test artifacts copied to <http://10.189.74.2:8080/job/saucy-adt-maas-daily/./ARCH=amd64,label=lenovo-RD230-01/ws/results>
+ [ -n 2013-08-20_23-30-53 ]
+ log_info_msg Updating Jenkins results
+ log_msg Info: Updating Jenkins results\n
+ date +%F %X
+ printf 2013-08-20 22:09:29: Info: Updating Jenkins results\n
2013-08-20 22:09:29: Info: Updating Jenkins results
+ rsync -a <http://10.189.74.2:8080/job/saucy-adt-maas-daily/./ARCH=amd64,label=lenovo-RD230-01/ws/results/saucy_amd64_maas_20130821-020942.result> /saucy/out/
rsync: mkdir "/saucy/out" failed: No such file or directory (2)
rsync error: error in file IO (code 11) at main.c(605) [Receiver=3.0.9]
rsync: connection unexpectedly closed (9 bytes received so far) [sender]
rsync error: error in rsync protocol data stream (code 12) at io.c(605) [sender=3.0.9]
+ true
+ [ 0 -eq 0 ]
+ ssh -o UserKnownHostsFile=/dev/null -o StrictHostKeyChecking=no -o CheckHostIP=no -i /var/tmp/adt/disks/adtkey -p 54323 -t -o BatchMode=yes -l ubuntu localhost sudo poweroff
Pseudo-terminal will not be allocated because stdin is not a terminal.
Warning: Permanently added '[localhost]:54323' (ECDSA) to the list of known hosts.
+ exit 12
+ on_exit
+ log_info_msg Cleaning up
+ log_msg Info: Cleaning up\n
+ date +%F %X
+ printf 2013-08-20 22:09:30: Info: Cleaning up\n
2013-08-20 22:09:30: Info: Cleaning up
+ [ -f /var/tmp/adt/disks/saucy-amd64-maas-20130820_220350.aQazgs.img.pid ]
+ cat /var/tmp/adt/disks/saucy-amd64-maas-20130820_220350.aQazgs.img.pid
+ kill -9 29212
+ rm -f /var/tmp/adt/disks/saucy-amd64-maas-20130820_220350.aQazgs.img.pid
+ rm -f /var/tmp/adt/disks/saucy-amd64-maas-20130820_220350.aQazgs.img
+ rm -f /var/lock/adt/ssh.54323.lock
+ rm -f /var/lock/adt/vnc.5911.lock
+ [ -d /tmp/adt-amd64.qIjxi3 ]
+ rm -Rf /tmp/adt-amd64.qIjxi3
+ rm -f /var/tmp/adt/disks/saucy-amd64-maas-*.img*
+ find /var/lock/adt -name *.lock -mtime +1
+ exit 12
Build step 'Execute shell' marked build as failure
Archiving artifacts


Follow ups