← Back to team overview

touch-packages team mailing list archive

[Bug 1405087] Re: package click-apparmor 0.2.11.2 failed to install/upgrade: el subproceso script pre-removal nuevo devolvió el código de salida de error 1

 

>From VarLogDistupgradeApttermlog.gz:

Preparing to unpack .../click-apparmor_0.2.11.2_amd64.deb ...
Traceback (most recent call last):
  File "/usr/bin/click", line 31, in <module>
    from click import commands
ImportError: cannot import name 'commands'
dpkg: aviso: el subproceso script de `pre-removal' antiguo devolvió el código de salida de error 1
dpkg: probando el script del nuevo paquete en su lugar...
Traceback (most recent call last):
  File "/usr/bin/click", line 31, in <module>
    from click import commands
ImportError: cannot import name 'commands'
dpkg: error al procesar el archivo /var/cache/apt/archives/click-apparmor_0.2.11.2_amd64.deb (--unpack):
 el subproceso script pre-removal nuevo devolvió el código de salida de error 1


This appears to be a problem with click not having what it needs when the prerm is run.

** Package changed: click-apparmor (Ubuntu) => click (Ubuntu)

-- 
You received this bug notification because you are a member of Ubuntu
Touch seeded packages, which is subscribed to click-apparmor in Ubuntu.
https://bugs.launchpad.net/bugs/1405087

Title:
  package click-apparmor 0.2.11.2 failed to install/upgrade: el
  subproceso script pre-removal nuevo devolvió el código de salida de
  error 1

Status in click package in Ubuntu:
  New

Bug description:
  Ungrade to ubuntu 14.10 from 14.04

  ProblemType: Package
  DistroRelease: Ubuntu 14.10
  Package: click-apparmor 0.2.11.2
  ProcVersionSignature: Ubuntu 3.13.0-44.73-generic 3.13.11-ckt12
  Uname: Linux 3.13.0-44-generic x86_64
  NonfreeKernelModules: vboxpci vboxnetadp vboxnetflt vboxdrv
  ApportVersion: 2.14.1-0ubuntu3.6
  Architecture: amd64
  Date: Tue Dec 23 08:04:25 2014
  DistributionChannelDescriptor:
   # This is a distribution channel descriptor
   # For more information see http://wiki.ubuntu.com/DistributionChannelDescriptor
   canonical-oem-somerville-precise-amd64-20120703-2
  DuplicateSignature: package:click-apparmor:0.2.11.2:el subproceso script pre-removal nuevo devolvió el código de salida de error 1
  ErrorMessage: el subproceso script pre-removal nuevo devolvió el código de salida de error 1
  InstallationDate: Installed on 2013-07-21 (519 days ago)
  InstallationMedia: Ubuntu 12.04 "Precise" - Build amd64 LIVE Binary 20120703-15:08
  SourcePackage: click-apparmor
  Title: package click-apparmor 0.2.11.2 failed to install/upgrade: el subproceso script pre-removal nuevo devolvió el código de salida de error 1
  UpgradeStatus: Upgraded to utopic on 2014-12-23 (0 days ago)

To manage notifications about this bug go to:
https://bugs.launchpad.net/ubuntu/+source/click/+bug/1405087/+subscriptions


References