gnome-colors-packagers team mailing list archive
-
gnome-colors-packagers team
-
Mailing list archive
-
Message #00307
[Bug 841004] [NEW] package gnome-colors-common 5.5.1-1 failed to install/upgrade: subprocess installed post-installation script returned error exit status 2
*** This bug is a duplicate of bug 835414 ***
https://bugs.launchpad.net/bugs/835414
Public bug reported:
that is bug
ProblemType: Package
DistroRelease: Ubuntu 11.10
Package: gnome-colors-common 5.5.1-1
ProcVersionSignature: Ubuntu 3.0.0-10.16-generic 3.0.4
Uname: Linux 3.0.0-10-generic x86_64
NonfreeKernelModules: nvidia
AptOrdering:
gnome-colors-common: Install
gnome-human-icon-theme: Install
gnome-colors-common: Configure
gnome-human-icon-theme: Configure
Architecture: amd64
Date: Sun Sep 4 15:26:12 2011
DuplicateSignature:
Setting up gnome-colors-common (5.5.1-1) ...
update-alternatives: using /usr/share/icons/gnome-colors-common/scalable/places/gnome-colors.svg to provide /usr/share/icons/gnome/scalable/places/start-here.svg (start-here.svg) in auto mode.
update-alternatives: error: unable to make /usr/share/icons/gnome/16x16/places/start-here.png.dpkg-tmp a symlink to /etc/alternatives/start-here-16.png: No such file or directory
dpkg: error processing gnome-colors-common (--configure):
subprocess installed post-installation script returned error exit status 2
ErrorMessage: subprocess installed post-installation script returned error exit status 2
InstallationMedia: Ubuntu 11.10 "Oneiric Ocelot" - Beta amd64+mac (20110901)
PackageArchitecture: all
SourcePackage: gnome-colors
Title: package gnome-colors-common 5.5.1-1 failed to install/upgrade: subprocess installed post-installation script returned error exit status 2
UpgradeStatus: No upgrade log present (probably fresh install)
** Affects: gnome-colors (Ubuntu)
Importance: Undecided
Status: New
** Tags: amd64 apport-package oneiric
--
You received this bug notification because you are a member of GNOME-
Colors Packagers, which is subscribed to gnome-colors in Ubuntu.
https://bugs.launchpad.net/bugs/841004
Title:
package gnome-colors-common 5.5.1-1 failed to install/upgrade:
subprocess installed post-installation script returned error exit
status 2
Status in “gnome-colors” package in Ubuntu:
New
Bug description:
that is bug
ProblemType: Package
DistroRelease: Ubuntu 11.10
Package: gnome-colors-common 5.5.1-1
ProcVersionSignature: Ubuntu 3.0.0-10.16-generic 3.0.4
Uname: Linux 3.0.0-10-generic x86_64
NonfreeKernelModules: nvidia
AptOrdering:
gnome-colors-common: Install
gnome-human-icon-theme: Install
gnome-colors-common: Configure
gnome-human-icon-theme: Configure
Architecture: amd64
Date: Sun Sep 4 15:26:12 2011
DuplicateSignature:
Setting up gnome-colors-common (5.5.1-1) ...
update-alternatives: using /usr/share/icons/gnome-colors-common/scalable/places/gnome-colors.svg to provide /usr/share/icons/gnome/scalable/places/start-here.svg (start-here.svg) in auto mode.
update-alternatives: error: unable to make /usr/share/icons/gnome/16x16/places/start-here.png.dpkg-tmp a symlink to /etc/alternatives/start-here-16.png: No such file or directory
dpkg: error processing gnome-colors-common (--configure):
subprocess installed post-installation script returned error exit status 2
ErrorMessage: subprocess installed post-installation script returned error exit status 2
InstallationMedia: Ubuntu 11.10 "Oneiric Ocelot" - Beta amd64+mac (20110901)
PackageArchitecture: all
SourcePackage: gnome-colors
Title: package gnome-colors-common 5.5.1-1 failed to install/upgrade: subprocess installed post-installation script returned error exit status 2
UpgradeStatus: No upgrade log present (probably fresh install)
To manage notifications about this bug go to:
https://bugs.launchpad.net/ubuntu/+source/gnome-colors/+bug/841004/+subscriptions
Follow ups
References