← Back to team overview

graphics-drivers-testers team mailing list archive

nvidia-driver-550 fails to install on mantic



I am not able to install nvidia-driver-550 on mantic. It seems to be
failing on the nvidia-dkms-550 package due to a missing header file.


ProblemType: Package
 DKMS make.log for nvidia-550.40.07 for kernel 6.5.0-15-generic (x86_64)
 2024-01-30T19:37:53 CET
 make[1]: Entering directory '/usr/src/linux-headers-6.5.0-15-generic'
 make --no-print-directory -C /usr/src/linux-headers-6.5.0-15-generic \
 -f /usr/src/linux-headers-6.5.0-15-generic/Makefile modules
 warning: the compiler differs from the one used to build the kernel
   The kernel was built by: x86_64-linux-gnu-gcc-13 (Ubuntu
13.2.0-4ubuntu3) 13.2.0
   You are using:           cc (Ubuntu 13.2.0-4ubuntu3) 13.2.0
 make -f ./scripts/Makefile.build obj=/var/lib/dkms/nvidia/550.40.07/build
need-builtin=1 need-modorder=1
/var/lib/dkms/nvidia/550.40.07/build/header-presence-tests.mk: No such file
or directory
 make[3]: *** No rule to make target '/var/lib/dkms/nvidia/550.40.07/build/
header-presence-tests.mk'.  Stop.
 make[2]: *** [/usr/src/linux-headers-6.5.0-15-generic/Makefile:2037:
/var/lib/dkms/nvidia/550.40.07/build] Error 2
 make[1]: *** [Makefile:234: __sub-make] Error 2
 make[1]: Leaving directory '/usr/src/linux-headers-6.5.0-15-generic'
 make: *** [Makefile:85: modules] Error 2
DKMSKernelVersion: 6.5.0-15-generic
Date: Tue Jan 30 19:37:53 2024
Package: nvidia-dkms-550 550.40.07-0ubuntu0~gpu23.10.1
PackageVersion: 550.40.07-0ubuntu0~gpu23.10.1
SourcePackage: nvidia-graphics-drivers-550
Title: nvidia-dkms-550 550.40.07-0ubuntu0~gpu23.10.1: nvidia kernel module
failed to build

Mvh. Tais P. Hansen