← Back to team overview

graphics-drivers-testers team mailing list archive

Nvidia 550 - Canoct compile DKMS modules


Hi all,

hopefully this is correct way to report a bug (only way I had found).

I just tried to install new nvidia drvers version 550 from PPA on my Ubuntu 23.10 and I cannot past DKMS build.

Compilation complain about missing header-presence-tests.mk which is really not on that place.

Full log:

ProblemType: Package
 DKMS make.log for nvidia-550.40.07 for kernel 6.5.0-15-generic (x86_64)
 Út 30. ledna 2024, 19:53:11 CET
 make[1]: Vstupuje se do adresáře „/usr/src/linux-headers-6.5.0-15-generic“
 make --no-print-directory -C /usr/src/linux-headers-6.5.0-15-generic \
 -f /usr/src/linux-headers-6.5.0-15-generic/Makefile modules
 warning: the compiler differs from the one used to build the kernel
   The kernel was built by: x86_64-linux-gnu-gcc-13 (Ubuntu 13.2.0-4ubuntu3) 13.2.0
   You are using:           cc (Ubuntu 13.2.0-4ubuntu3) 13.2.0
 make -f ./scripts/Makefile.build obj=/var/lib/dkms/nvidia/550.40.07/build need-builtin=1 need-modorder=1  /var/lib/dkms/nvidia/550.40.07/build/Kbuild:233: /var/lib/dkms/nvidia/550.40.07/build/header-presence-tests.mk: Adresář nebo soubor neexistuje  make[3]: *** Žádné pravidlo jak vyrobit cíl „/var/lib/dkms/nvidia/550.40.07/build/header-presence-tests.mk“. Konec.  make[2]: *** [/usr/src/linux-headers-6.5.0-15-generic/Makefile:2037: /var/lib/dkms/nvidia/550.40.07/build] Chyba 2
 make[1]: *** [Makefile:234: __sub-make] Chyba 2
 make[1]: Opouští se adresář „/usr/src/linux-headers-6.5.0-15-generic“
 make: *** [Makefile:85: modules] Chyba 2
DKMSKernelVersion: 6.5.0-15-generic
Date: Tue Jan 30 19:53:12 2024
Package: nvidia-dkms-550 550.40.07-0ubuntu0~gpu23.10.1
PackageVersion: 550.40.07-0ubuntu0~gpu23.10.1
SourcePackage: nvidia-graphics-drivers-550
Title: nvidia-dkms-550 550.40.07-0ubuntu0~gpu23.10.1: nvidia kernel module failed to build

If I can provide more feedback, let me please know. If this is incorrect place, I am sorry.

Thank You